Building Solution: TvOSTabbedApp (Debug|iPhoneSimulator)

Build started 9/9/2016 6:58:45 PM.
__________________________________________________
Project "/Users/builder/QABot/data/lanes/3524/68292d1a/source/QualityAssurance/Automation/XQA/XQA.XS.Tests/bin/Debug/TestResults/68292d1a/TestCreateBuildTvOSBroadcastUIExtension/Temp/TvOSBroadcastUIExtension/TvOSBroadcastUIExtension.csproj" (Build target(s)):
	
	Target _DetectAppManifest:
		FindItemWithLogicalName Task
		  Items:
		    Info.plist
		    Entitlements.plist
		  LogicalName: Info.plist
		  ProjectDir: /Users/builder/QABot/data/lanes/3524/68292d1a/source/QualityAssurance/Automation/XQA/XQA.XS.Tests/bin/Debug/TestResults/68292d1a/TestCreateBuildTvOSBroadcastUIExtension/Temp/TvOSBroadcastUIExtension
		  ResourcePrefix: Resources
	
	Target _DetectSdkLocations:
		DetectSdkLocations Task
		  TargetFrameworkIdentifier: Xamarin.TVOS
		  TargetArchitectures: x86_64
		  SdkVersion: 10.0
		  XamarinSdkRoot: /Library/Frameworks/Xamarin.iOS.framework/Versions/Current
		  SdkRoot: /Applications/Xcode.app/Contents/Developer/Platforms/AppleTVSimulator.platform/Developer/SDKs/AppleTVSimulator10.0.sdk
		  SdkDevPath: /Applications/Xcode.app/Contents/Developer
		  SdkUsrPath: /Applications/Xcode.app/Contents/Developer/usr
		  SdkPlatform: AppleTVSimulator
		  SdkIsSimulator: True
	
	Target _DetectSigningIdentity:
		DetectSigningIdentity Task
		  AppBundleName: TvOSBroadcastUIExtension
		  AppManifest: Info.plist
		  Keychain: 
		  ProvisioningProfile: 
		  RequireCodesigning: False
		  SdkPlatform: AppleTVSimulator
		  SdkIsSimulator: True
		  SigningKey: iPhone Developer
		Multiple signing identities match 'iPhone Developer'; using the first match.
		  1. Signing Identity: iPhone Developer: Xamarin QA (JP4JS5NR3R) (1666405F2292ACE441B33C04D0AFA3B78071D2CE)
		  2. Signing Identity: iPhone Developer: Xamarin QA (943YW87293) (A2F05A3AFB82EDF60E721DD0987485E497E84F31)
		Detected signing identity:
		  Code Signing Key: "iPhone Developer: Xamarin QA (JP4JS5NR3R)" (1666405F2292ACE441B33C04D0AFA3B78071D2CE)
		  Bundle Id: com.xamarin.tvostabbedapp.tvosbroadcastuiextension
		  App Id: com.xamarin.tvostabbedapp.tvosbroadcastuiextension
	
	Target PrepareForBuild:
		Configuration: Debug Platform: iPhoneSimulator
	
	Target _CoreCompileInterfaceDefinitions:
		IBTool Task
		  AppManifest: Info.plist
		  InterfaceDefinitions:
		    MainInterface.storyboard
		  IntermediateOutputPath: obj/iPhoneSimulator/Debug/
		  IsWatchApp: False
		  IsWatch2App: False
		  IsAppExtension: False
		  ProjectDir: /Users/builder/QABot/data/lanes/3524/68292d1a/source/QualityAssurance/Automation/XQA/XQA.XS.Tests/bin/Debug/TestResults/68292d1a/TestCreateBuildTvOSBroadcastUIExtension/Temp/TvOSBroadcastUIExtension
		  ResourcePrefix: Resources
		  SdkBinPath: /Applications/Xcode.app/Contents/Developer/usr/bin
		  SdkPlatform: AppleTVSimulator
		  SdkRoot: /Applications/Xcode.app/Contents/Developer/Platforms/AppleTVSimulator.platform/Developer/SDKs/AppleTVSimulator10.0.sdk
		  SdkVersion: 10.0
		Tool /Applications/Xcode.app/Contents/Developer/usr/bin/ibtool execution started with arguments: --errors --warnings --notices --output-format xml1 --minimum-deployment-target 10.0 --auto-activate-custom-fonts --sdk /Applications/Xcode.app/Contents/Developer/Platforms/AppleTVSimulator.platform/Developer/SDKs/AppleTVSimulator10.0.sdk --compilation-directory /Users/builder/QABot/data/lanes/3524/68292d1a/source/QualityAssurance/Automation/XQA/XQA.XS.Tests/bin/Debug/TestResults/68292d1a/TestCreateBuildTvOSBroadcastUIExtension/Temp/TvOSBroadcastUIExtension/obj/iPhoneSimulator/Debug/ibtool /Users/builder/QABot/data/lanes/3524/68292d1a/source/QualityAssurance/Automation/XQA/XQA.XS.Tests/bin/Debug/TestResults/68292d1a/TestCreateBuildTvOSBroadcastUIExtension/Temp/TvOSBroadcastUIExtension/MainInterface.storyboard
		Tool /Applications/Xcode.app/Contents/Developer/usr/bin/ibtool execution started with arguments: --errors --warnings --notices --output-format xml1 --minimum-deployment-target 10.0 --auto-activate-custom-fonts --sdk /Applications/Xcode.app/Contents/Developer/Platforms/AppleTVSimulator.platform/Developer/SDKs/AppleTVSimulator10.0.sdk --link /Users/builder/QABot/data/lanes/3524/68292d1a/source/QualityAssurance/Automation/XQA/XQA.XS.Tests/bin/Debug/TestResults/68292d1a/TestCreateBuildTvOSBroadcastUIExtension/Temp/TvOSBroadcastUIExtension/obj/iPhoneSimulator/Debug/ibtool-link /Users/builder/QABot/data/lanes/3524/68292d1a/source/QualityAssurance/Automation/XQA/XQA.XS.Tests/bin/Debug/TestResults/68292d1a/TestCreateBuildTvOSBroadcastUIExtension/Temp/TvOSBroadcastUIExtension/obj/iPhoneSimulator/Debug/ibtool/MainInterface.storyboardc
		  BundleResources Output:
		    obj/iPhoneSimulator/Debug/ibtool-link/MainInterface.storyboardc/Info.plist
		    obj/iPhoneSimulator/Debug/ibtool-link/MainInterface.storyboardc/ipu-8l-YXA-view-Jb2-bm-o24.nib
		    obj/iPhoneSimulator/Debug/ibtool-link/MainInterface.storyboardc/mainBroadcastStoryboard.nib
		  OutputManifests Output:
		    obj/iPhoneSimulator/Debug/ibtool-manifests/MainInterface.storyboardc
		    obj/iPhoneSimulator/Debug/ibtool-manifests/link
	
	Target _CollectColladaAssets:
		CollectBundleResources Task
		  BundleResources: 
		  OptimizePropertyLists: False
		  OptimizePNGs: False
		  ProjectDir: /Users/builder/QABot/data/lanes/3524/68292d1a/source/QualityAssurance/Automation/XQA/XQA.XS.Tests/bin/Debug/TestResults/68292d1a/TestCreateBuildTvOSBroadcastUIExtension/Temp/TvOSBroadcastUIExtension
		  ResourcePrefix: Resources
	
	Target _CoreCompileColladaAssets:
	No input files were specified for target _CoreCompileColladaAssets, skipping.
	
	Target _BeforeCoreCompileSceneKitAssets:
	No input files were specified for target _BeforeCoreCompileSceneKitAssets, skipping.
	
	Target _CoreCompileSceneKitAssets:
	No input files were specified for target _CoreCompileSceneKitAssets, skipping.
	
	Target _BeforeCompileTextureAtlases:
	No input files were specified for target _BeforeCompileTextureAtlases, skipping.
	
	Target _CoreCompileTextureAtlases:
	No input files were specified for target _CoreCompileTextureAtlases, skipping.
	
	Target _CollectBundleResources:
		CollectBundleResources Task
		  BundleResources:
		  OptimizePropertyLists: True
		  OptimizePNGs: True
		  ProjectDir: /Users/builder/QABot/data/lanes/3524/68292d1a/source/QualityAssurance/Automation/XQA/XQA.XS.Tests/bin/Debug/TestResults/68292d1a/TestCreateBuildTvOSBroadcastUIExtension/Temp/TvOSBroadcastUIExtension
		  ResourcePrefix: Resources
	
	Target _CoreOptimizePngImages:
	No output files were specified for target _CoreOptimizePngImages, skipping.
	
	Target _CoreOptimizePropertyLists:
	No input files were specified for target _CoreOptimizePropertyLists, skipping.
	
	Target _CoreOptimizeLocalizationFiles:
	No input files were specified for target _CoreOptimizeLocalizationFiles, skipping.
	
	Target _UnpackLibraryResources:
		UnpackLibraryResources Task
		  Prefix: monotouch
		  IntermediateOutputPath: obj/iPhoneSimulator/Debug/
		  NoOverwrite:
		    obj/iPhoneSimulator/Debug/ibtool-link/MainInterface.storyboardc/Info.plist
		    obj/iPhoneSimulator/Debug/ibtool-link/MainInterface.storyboardc/ipu-8l-YXA-view-Jb2-bm-o24.nib
		    obj/iPhoneSimulator/Debug/ibtool-link/MainInterface.storyboardc/mainBroadcastStoryboard.nib
		  ReferencedLibraries:
		    /Library/Frameworks/Xamarin.iOS.framework/Versions/Current/lib/mono/Xamarin.TVOS/System.dll
		    /Library/Frameworks/Xamarin.iOS.framework/Versions/Current/lib/mono/Xamarin.TVOS/System.Xml.dll
		    /Library/Frameworks/Xamarin.iOS.framework/Versions/Current/lib/mono/Xamarin.TVOS/System.Core.dll
		    /Library/Frameworks/Xamarin.iOS.framework/Versions/Current/lib/mono/Xamarin.TVOS/Xamarin.TVOS.dll
		    /Library/Frameworks/Xamarin.iOS.framework/Versions/Current/lib/mono/Xamarin.TVOS//mscorlib.dll
	
	Target GenerateSatelliteAssemblies:
	No input files were specified for target GenerateSatelliteAssemblies, skipping.
	
	Target CoreCompile:
		Tool /Library/Frameworks/Mono.framework/Versions/4.6.0/lib/mono/4.5/mcs.exe execution started with arguments: /noconfig /debug:full /debug+ /optimize- /out:obj/iPhoneSimulator/Debug/TvOSBroadcastUIExtension.dll BroadcastViewController.cs BroadcastViewController.designer.cs obj/iPhoneSimulator/Debug/Xamarin.TVOS,Version=v1.0.AssemblyAttribute.cs /target:library /define:"__UNIFIED__;__MOBILE__;__TVOS__;DEBUG" /nostdlib /reference:/Library/Frameworks/Xamarin.iOS.framework/Versions/Current/lib/mono/Xamarin.TVOS/System.dll /reference:/Library/Frameworks/Xamarin.iOS.framework/Versions/Current/lib/mono/Xamarin.TVOS/System.Xml.dll /reference:/Library/Frameworks/Xamarin.iOS.framework/Versions/Current/lib/mono/Xamarin.TVOS/System.Core.dll /reference:/Library/Frameworks/Xamarin.iOS.framework/Versions/Current/lib/mono/Xamarin.TVOS/Xamarin.TVOS.dll /reference:/Library/Frameworks/Xamarin.iOS.framework/Versions/Current/lib/mono/Xamarin.TVOS//mscorlib.dll /warn:4
BroadcastViewController.cs(33,21): error CS1928: Type `Foundation.NSExtensionContext' does not contain a member `CompleteRequest' and the best extension method overload `ReplayKit.NSExtensionContext_RPBroadcastExtension.CompleteRequest(this Foundation.NSExtensionContext, Foundation.NSUrl, ReplayKit.RPBroadcastConfiguration, Foundation.NSDictionary)' has some invalid arguments
		/Library/Frameworks/Xamarin.iOS.framework/Versions/Current/lib/mono/Xamarin.TVOS/Xamarin.TVOS.dll (Location of the symbol related to previous error)
BroadcastViewController.cs(33,21): error CS1501: No overload for method `CompleteRequest' takes `3' arguments
		/Library/Frameworks/Xamarin.iOS.framework/Versions/Current/lib/mono/Xamarin.TVOS/Xamarin.TVOS.dll (Location of the symbol related to previous error)
	Task "Csc" execution -- FAILED
	Done building target "CoreCompile" in project "/Users/builder/QABot/data/lanes/3524/68292d1a/source/QualityAssurance/Automation/XQA/XQA.XS.Tests/bin/Debug/TestResults/68292d1a/TestCreateBuildTvOSBroadcastUIExtension/Temp/TvOSBroadcastUIExtension/TvOSBroadcastUIExtension.csproj".-- FAILED
	
Done building project "/Users/builder/QABot/data/lanes/3524/68292d1a/source/QualityAssurance/Automation/XQA/XQA.XS.Tests/bin/Debug/TestResults/68292d1a/TestCreateBuildTvOSBroadcastUIExtension/Temp/TvOSBroadcastUIExtension/TvOSBroadcastUIExtension.csproj".-- FAILED

Build FAILED.
Errors:

/Users/builder/QABot/data/lanes/3524/68292d1a/source/QualityAssurance/Automation/XQA/XQA.XS.Tests/bin/Debug/TestResults/68292d1a/TestCreateBuildTvOSBroadcastUIExtension/Temp/TvOSBroadcastUIExtension/TvOSBroadcastUIExtension.csproj (Build) ->
/Library/Frameworks/Mono.framework/Versions/4.6.0/lib/mono/xbuild/14.0/bin/Microsoft.CSharp.targets (CoreCompile target) ->

	BroadcastViewController.cs(33,21): error CS1928: Type `Foundation.NSExtensionContext' does not contain a member `CompleteRequest' and the best extension method overload `ReplayKit.NSExtensionContext_RPBroadcastExtension.CompleteRequest(this Foundation.NSExtensionContext, Foundation.NSUrl, ReplayKit.RPBroadcastConfiguration, Foundation.NSDictionary)' has some invalid arguments
	BroadcastViewController.cs(33,21): error CS1501: No overload for method `CompleteRequest' takes `3' arguments

	 0 Warning(s)
	 2 Error(s)

Time Elapsed 00:00:03.0072820

---------------------- Done ----------------------

Build: 2 errors, 0 warnings